{"text_format":"1","workbook":"xlsx","n_sheets":9,"sheets":["DI","custom-coscho","Internal","eSPAR","eDESIND","pRCF","Main","pRCF ","eDESIND "],"not_rendered":{"charts":0,"images":4,"macros":1,"external_links":0,"defined_names":2,"comments":4,"pivot_tables":0},"unopened":[],"bounds":{"document_bytes":16777216,"sheet_cells":100000,"rows_first":2000,"rows_last":500,"rows_between":2000,"halvings":0,"cell_chars":16384,"cell_head_chars":4096},"cells_cut":0,"cells_raw":0,"read":"whole","date_system":"1900"}

{"sheet":"DI","index":0,"n_rows":293,"n_cols":2,"rows_kept":293,"cut":false,"hidden":false,"merged":[[225,0,225,1],[0,0,0,1],[1,0,1,1],[2,0,2,1],[86,0,86,1],[156,0,156,1]]}
["Descriptive Indicators"]
["2 (A) : LIFE SKILLS (Grading on Five point scale A, B, C, D, E)"]
["DI Codes For Class 10th"]
["CODE","Thinking Skills"]
[901,"Student demonstrates the ability to Be original, flexible and imaginative "]
[902,"Student demonstrates the ability to Raise questions, identify and analyze  problems"]
[903,"Demonstrates the ability to Implement a well-thought decision and take responsibility"]
[904,"Student demonstrates the ability to Generate new ideas with fluency"]
[905,"Student demonstrates the ability to Elaborate/build on new ideas. "]
[906,"Knows his/her strengths and weaknesses"]
{"$rows_left_out":284}
{"sheet":"custom-coscho","index":1,"n_rows":86,"n_cols":7,"rows_kept":86,"cut":false,"hidden":false,"merged":[[2,2,2,3]]}
[]
[]
[null,null,"Manage Co-Scholastic 3 A & B"]
[]
["Roll No.","Name","3 (a) 1","3 (a) 2","3 (b) 1","3 (b) 2"]
[null,null,"Select from List"]
[{"$f":"eSPAR!A6","v":1},{"$f":"eSPAR!B6","v":0},"Literary & Creative Skill","Scientific Skill","Sports/ Indigenous Sports","Yoga","Literary & Creative Skill"]
[{"$f":"eSPAR!A7","v":0},{"$f":"eSPAR!B7","v":0},"Literary & Creative Skill","Scientific Skill","Sports/ Indigenous Sports","Yoga","Scientific Skill"]
[{"$f":"eSPAR!A8","v":0},{"$f":"eSPAR!B8","v":0},"Literary & Creative Skill","Scientific Skill","Sports/ Indigenous Sports","Yoga","Information & Communication Technology (ICT)"]
[{"$f":"eSPAR!A9","v":0},{"$f":"eSPAR!B9","v":0},"Literary & Creative Skill","Scientific Skill","Sports/ Indigenous Sports","Yoga","Organisational & Leadership Skill (Clubs)"]
{"$rows_left_out":77}
{"sheet":"Internal","index":2,"n_rows":30,"n_cols":6,"rows_kept":30,"cut":false,"hidden":false,"merged":[[33,1,33,6],[1,1,1,6],[28,1,28,6],[29,1,29,6],[30,1,30,6],[2,1,2,2],[2,4,2,5],[24,2,24,6],[25,2,25,6],[26,2,26,6],[32,1,32,6]]}
[]
[null,"School Information"]
[null,"SCHOLASTIC",null,"GP","CO-SCHOLASTIC"]
[null,0,"E2","-",0,"F"]
[null,21,"E1","-",0.65,"D"]
[null,33,"D",4,0.69,"D+"]
[null,41,"C2",5,0.7,"C"]
[null,51,"C1",6,0.83,"C+"]
[null,61,"B2",7,0.85,"B"]
[null,71,"B1",8,0.92,"B+"]
{"$rows_left_out":21}
{"sheet":"eSPAR","index":3,"n_rows":6,"n_cols":7,"rows_kept":6,"cut":false,"hidden":false,"merged":[[1,0,1,6]]}
[]
["ENTER Students Particulars"]
[]
[]
["Adm. No.","Name","Section","Board Roll Number","Date of Birth","Mother's Name","Father's Name"]
[1]

{"sheet":"eDESIND","index":4,"n_rows":86,"n_cols":28,"rows_kept":86,"cut":false,"hidden":false,"merged":[[4,16,4,17],[4,18,4,19],[4,20,4,21],[0,0,0,11],[1,0,1,11],[2,0,2,1],[2,2,2,7],[2,8,2,11],[4,22,4,23],[2,12,2,19],[2,20,3,23],[2,24,3,27],[3,0,5,0],[3,1,5,1],[3,2,4,3],[3,4,4,5],[3,6,4,7],[3,8,4,9],[3,10,4,11],[3,12,3,19],[4,24,4,25],[4,26,4,27],[4,12,4,13],[4,14,4,15]]}
["Enter DI Code & Grade"]
[]
[null,null,"2 (A) : LIFE SKILLS (Grading on Five point scale A, B, C, D, E)",null,null,null,null,null,"2 (B) & 2 C",null,null,null,"2 (D) : ATTITUDES & VALUES (Grading on Five point scale A, B, C, D, E)",null,null,null,null,null,null,null,"PART 3 : (A) CO-SCHOLASTIC ACTIVITIES (Grading on Five point scale A, B, C, D, E)",null,null,null,"PART 3 : (B) HEALTH AND PHYSICAL EDUCATION (Grading on Five point scale A, B, C, D, E)"]
["Roll No.","Name","THINKING SKILLS",null,"SOCIAL SKILLS",null,"EMOTIONAL SKILLS",null,"2- B) WORK EDUCATION",null,"2 -C) VISUAL AND PERFORMING ARTS",null,"ATTITUDES TOWARDS"]
[null,null,null,null,null,null,null,null,null,null,null,null,"Teachers",null,"SCHOOL-MATES",null,"SCHOOL PROGRAMMES & ENVIRONMENT",null,"VALUE SYSTEMS",null,"3 (a) 1",null,"3 (a) 2",null,"3 (b) 1",null,"3 (b) 2"]
[null,null,"Grade","Enter DI Code","Grade","Enter DI Code","Grade","Enter DI Code","Grade","Enter DI Code","Grade","Enter DI Code","Grade","Enter DI Code","Grade","Enter DI Code","Grade","Enter DI Code","Grade","Enter DI Code","Grade","Enter DI Code","Grade","Enter DI Code","Grade","Enter DI Code","Grade","Enter DI Code"]
[{"$f":"eSPAR!A6","v":1},{"$f":"eSPAR!B6","v":0},"A",901]
[{"$f":"eSPAR!A7","v":0},{"$f":"eSPAR!B7","v":0}]
[{"$f":"eSPAR!A8","v":0},{"$f":"eSPAR!B8","v":0}]
[{"$f":"eSPAR!A9","v":0},{"$f":"eSPAR!B9","v":0}]
{"$rows_left_out":77}
{"sheet":"pRCF","index":5,"n_rows":41,"n_cols":7,"rows_kept":41,"cut":false,"hidden":false,"merged":[[42,0,42,1],[42,4,42,6],[33,1,33,4],[41,4,41,6],[41,0,41,2],[35,0,35,6],[36,1,36,4],[37,1,37,4],[38,1,38,4],[34,1,34,4],[32,1,32,4],[14,0,14,6],[27,1,27,4],[28,1,28,4],[29,1,29,4],[30,1,30,4],[19,0,19,6],[25,0,25,6],[15,1,15,4],[20,1,20,4],[26,1,26,4],[23,1,23,4],[24,1,24,4],[16,1,16,4],[17,1,17,4],[18,1,18,4],[21,1,21,4],[31,0,31,6],[0,0,0,6],[2,0,2,6],[8,4,8,5],[3,0,3,6],[13,0,13,6],[1,0,1,6],[5,0,5,6],[6,0,6,6],[22,0,22,6]]}
[{"$f":"'pRCF '!A1:G1","v":"ABC Public School"}]
[{"$f":"'pRCF '!A2:G2","v":"Affiliated to CBSE, Affiliation No.  120120"}]
[{"$f":"'pRCF '!A3:G3","v":"School Address1, City ABC, Delhi"}]
[{"$f":"'pRCF '!A4:G4","v":"Tel. No. 011-2222222, Email : schoolname@gmail.com"}]
[]
["Co-Scholastic Grade Certificate Class X 2017"]
[]
["Name of the Student",{"$f":"'pRCF '!B8","v":0}]
["Admission No.",1,null,"Section",{"$f":"'pRCF '!E9","v":0}]
["Roll No. (Alloted by CBSE)",{"$f":"'pRCF '!B10","v":0}]
{"$rows_left_out":32}
{"sheet":"Main","index":6,"n_rows":16,"n_cols":6,"rows_kept":16,"cut":false,"hidden":false,"merged":[[7,5,7,8],[11,5,12,8],[15,2,15,8],[14,2,14,8],[0,2,0,8],[12,2,12,3],[4,2,4,3],[11,2,11,3],[1,2,1,8],[2,2,2,8],[5,2,5,3],[4,5,4,8],[7,2,7,3],[6,2,6,3],[8,2,8,3],[9,2,9,3],[10,2,10,3],[9,5,10,8]]}
[null,null,{"$f":"Internal!C25","v":"ABC Public School"}]
[null,null,{"$f":"Internal!C27","v":"School Address1, City ABC, Delhi"}]
[null,null,"Co-Scholastic Grade Certificate Class X (2017)"]
[]
[null,null,"Commands",null,null,"How to Use This Utility?"]
[null,null,"Enter Student Particulars"]
[null,null,"DI Code List"]
[null,null,"Enter DI Codes & Grade"]
[null,null,"Customise Co-Scholastic Areas"]
[null,null,"Print Co-Scholastic Certificate",null,null,"For Step-By-Step Tutorial or Help, kindly visit the page below -"]
{"$rows_left_out":7}
{"sheet":"pRCF ","index":7,"n_rows":41,"n_cols":7,"rows_kept":41,"cut":false,"hidden":true,"merged":[[17,1,17,4],[0,0,0,6],[1,0,1,6],[2,0,2,6],[3,0,3,6],[5,0,5,6],[6,0,6,6],[8,4,8,5],[13,0,13,6],[14,0,14,6],[15,1,15,4],[16,1,16,4],[29,1,29,4],[18,1,18,4],[19,0,19,6],[20,1,20,4],[21,1,21,4],[22,0,22,6],[23,1,23,4],[24,1,24,4],[25,0,25,6],[26,1,26,4],[27,1,27,4],[28,1,28,4],[42,0,42,1],[42,4,42,6],[30,1,30,4],[31,0,31,6],[32,1,32,4],[33,1,33,4],[34,1,34,4],[35,0,35,6],[36,1,36,4],[37,1,37,4],[38,1,38,4],[41,0,41,2],[41,4,41,6]]}
[{"$f":"Internal!C25","v":"ABC Public School"}]
[{"$f":"\"Affiliated to CBSE, \"&\"Affiliation No.\"&\"  \" & Internal!C26","v":"Affiliated to CBSE, Affiliation No.  120120"}]
[{"$f":"Internal!C27","v":"School Address1, City ABC, Delhi"}]
[{"$f":"Internal!B30 & \",\" & \" \"& Internal!B29","v":"Tel. No. 011-2222222, Email : schoolname@gmail.com"}]
[]
["Co-Scholastic Grade Certificate Class X 2017"]
[]
["Name of the Student",{"$f":"VLOOKUP(B9,eSPAR!A6:G85,2,FALSE)","v":0}]
["Admission No.",{"$f":"pRCF!B9","v":1},null,"Section",{"$f":"VLOOKUP(B9,eSPAR!A6:G85,3,FALSE)","v":0}]
["Roll No. (Alloted by CBSE)",{"$f":"VLOOKUP(B9,eSPAR!A6:G85,4,FALSE)","v":0}]
{"$rows_left_out":32}
{"sheet":"eDESIND ","index":8,"n_rows":86,"n_cols":19,"rows_kept":86,"cut":false,"hidden":true,"merged":[[2,13,3,13],[2,0,2,1],[3,0,5,0],[3,1,5,1],[1,0,1,5],[3,7,3,9],[3,3,4,3],[3,2,4,2],[3,4,4,4],[3,5,4,5],[3,6,4,6],[0,0,0,5],[2,2,2,4],[2,7,2,10],[2,5,2,6],[2,11,3,11]]}
[]
[]
[]
["Roll No.","Name",null,null,null,null,null,null,null,null,null,null,null,null,null,null,null,"Utility Developed by : Paras Hosting,    Visit us at : www.ParasHosting.com",{"$f":"IF(R4=Main!C15,\"OK\",\"XX\")","v":"OK"}]
[null,null,null,null,null,null,null,null,null,null,null,null,null,null,null,null,null,"Help Line No. 097293 71551    Email : response@parasHosting.com",{"$f":"IF(R5=Main!C16,\"OK\",\"XX\")","v":"OK"}]
[null,null,"DI","DI","DI","DI","DI","DI","DI","DI","DI","DI","DI","DI","DI"]
[{"$f":"eSPAR!A6","v":1},{"$f":"eSPAR!B6","v":0},{"$f":"IF($R$7=\"Invalid\",\"Internal Error, Contact Support\",VLOOKUP(eDESIND!D7,DI!$A$5:$B$400,2,FALSE))","v":"Student demonstrates the ability to Be original, flexible and imaginative "},{"$f":"IF($R$7=\"Invalid\",\"Internal Error, Contact Support\",VLOOKUP(eDESIND!F7,DI!$A$5:$B$400,2,FALSE))","v":{"$error":"#N/A"}},{"$f":"IF($R$7=\"Invalid\",\"Internal Error, Contact Support\",VLOOKUP(eDESIND!H7,DI!$A$5:$B$400,2,FALSE))","v":{"$error":"#N/A"}},{"$f":"IF($R$7=\"Invalid\",\"Internal Error, Contact Support\",VLOOKUP(eDESIND!J7,DI!$A$5:$B$400,2,FALSE))","v":{"$error":"#N/A"}},{"$f":"IF($R$7=\"Invalid\",\"Internal Error, Contact Support\",VLOOKUP(eDESIND!L7,DI!$A$5:$B$400,2,FALSE))","v":{"$error":"#N/A"}},{"$f":"IF($R$7=\"Invalid\",\"Internal Error, Contact Support\",VLOOKUP(eDESIND!N7,DI!$A$5:$B$400,2,FALSE))","v":{"$error":"#N/A"}},{"$f":"IF($R$7=\"Invalid\",\"Internal Error, Contact Support\",VLOOKUP(eDESIND!P7,DI!$A$5:$B$400,2,FALSE))","v":{"$error":"#N/A"}},{"$f":"IF($R$7=\"Invalid\",\"Internal Error, Contact Support\",VLOOKUP(eDESIND!R7,DI!$A$5:$B$400,2,FALSE))","v":{"$error":"#N/A"}},{"$f":"IF($R$7=\"Invalid\",\"Internal Error, Contact Support\",VLOOKUP(eDESIND!T7,DI!$A$5:$B$400,2,FALSE))","v":{"$error":"#N/A"}},{"$f":"IF($R$7=\"Invalid\",\"Internal Error, Contact Support\",VLOOKUP(eDESIND!V7,DI!$A$5:$B$400,2,FALSE))","v":{"$error":"#N/A"}},{"$f":"IF($R$7=\"Invalid\",\"Internal Error, Contact Support\",VLOOKUP(eDESIND!X7,DI!$A$5:$B$400,2,FALSE))","v":{"$error":"#N/A"}},{"$f":"IF($R$7=\"Invalid\",\"Internal Error, Contact Support\",VLOOKUP(eDESIND!Z7,DI!$A$5:$B$400,2,FALSE))","v":{"$error":"#N/A"}},{"$f":"IF($R$7=\"Invalid\",\"Internal Error, Contact Support\",VLOOKUP(eDESIND!AB7,DI!$A$5:$B$400,2,FALSE))","v":{"$error":"#N/A"}},null,null,{"$f":"IF(AND(S4=\"OK\",S5=\"OK\"),\"OK\",\"Invalid\")","v":"OK"}]
[{"$f":"eSPAR!A7","v":0},{"$f":"eSPAR!B7","v":0},{"$f":"IF($R$7=\"Invalid\",\"Internal Error, Contact Support\",VLOOKUP(eDESIND!D8,DI!$A$5:$B$400,2,FALSE))","v":{"$error":"#N/A"}},{"$f":"IF($R$7=\"Invalid\",\"Internal Error, Contact Support\",VLOOKUP(eDESIND!F8,DI!$A$5:$B$400,2,FALSE))","v":{"$error":"#N/A"}},{"$f":"IF($R$7=\"Invalid\",\"Internal Error, Contact Support\",VLOOKUP(eDESIND!H8,DI!$A$5:$B$400,2,FALSE))","v":{"$error":"#N/A"}},{"$f":"IF($R$7=\"Invalid\",\"Internal Error, Contact Support\",VLOOKUP(eDESIND!J8,DI!$A$5:$B$400,2,FALSE))","v":{"$error":"#N/A"}},{"$f":"IF($R$7=\"Invalid\",\"Internal Error, Contact Support\",VLOOKUP(eDESIND!L8,DI!$A$5:$B$400,2,FALSE))","v":{"$error":"#N/A"}},{"$f":"IF($R$7=\"Invalid\",\"Internal Error, Contact Support\",VLOOKUP(eDESIND!N8,DI!$A$5:$B$400,2,FALSE))","v":{"$error":"#N/A"}},{"$f":"IF($R$7=\"Invalid\",\"Internal Error, Contact Support\",VLOOKUP(eDESIND!P8,DI!$A$5:$B$400,2,FALSE))","v":{"$error":"#N/A"}},{"$f":"IF($R$7=\"Invalid\",\"Internal Error, Contact Support\",VLOOKUP(eDESIND!R8,DI!$A$5:$B$400,2,FALSE))","v":{"$error":"#N/A"}},{"$f":"IF($R$7=\"Invalid\",\"Internal Error, Contact Support\",VLOOKUP(eDESIND!T8,DI!$A$5:$B$400,2,FALSE))","v":{"$error":"#N/A"}},{"$f":"IF($R$7=\"Invalid\",\"Internal Error, Contact Support\",VLOOKUP(eDESIND!V8,DI!$A$5:$B$400,2,FALSE))","v":{"$error":"#N/A"}},{"$f":"IF($R$7=\"Invalid\",\"Internal Error, Contact Support\",VLOOKUP(eDESIND!X8,DI!$A$5:$B$400,2,FALSE))","v":{"$error":"#N/A"}},{"$f":"IF($R$7=\"Invalid\",\"Internal Error, Contact Support\",VLOOKUP(eDESIND!Z8,DI!$A$5:$B$400,2,FALSE))","v":{"$error":"#N/A"}},{"$f":"IF($R$7=\"Invalid\",\"Internal Error, Contact Support\",VLOOKUP(eDESIND!AB8,DI!$A$5:$B$400,2,FALSE))","v":{"$error":"#N/A"}}]
[{"$f":"eSPAR!A8","v":0},{"$f":"eSPAR!B8","v":0},{"$f":"IF($R$7=\"Invalid\",\"Internal Error, Contact Support\",VLOOKUP(eDESIND!D9,DI!$A$5:$B$400,2,FALSE))","v":{"$error":"#N/A"}},{"$f":"IF($R$7=\"Invalid\",\"Internal Error, Contact Support\",VLOOKUP(eDESIND!F9,DI!$A$5:$B$400,2,FALSE))","v":{"$error":"#N/A"}},{"$f":"IF($R$7=\"Invalid\",\"Internal Error, Contact Support\",VLOOKUP(eDESIND!H9,DI!$A$5:$B$400,2,FALSE))","v":{"$error":"#N/A"}},{"$f":"IF($R$7=\"Invalid\",\"Internal Error, Contact Support\",VLOOKUP(eDESIND!J9,DI!$A$5:$B$400,2,FALSE))","v":{"$error":"#N/A"}},{"$f":"IF($R$7=\"Invalid\",\"Internal Error, Contact Support\",VLOOKUP(eDESIND!L9,DI!$A$5:$B$400,2,FALSE))","v":{"$error":"#N/A"}},{"$f":"IF($R$7=\"Invalid\",\"Internal Error, Contact Support\",VLOOKUP(eDESIND!N9,DI!$A$5:$B$400,2,FALSE))","v":{"$error":"#N/A"}},{"$f":"IF($R$7=\"Invalid\",\"Internal Error, Contact Support\",VLOOKUP(eDESIND!P9,DI!$A$5:$B$400,2,FALSE))","v":{"$error":"#N/A"}},{"$f":"IF($R$7=\"Invalid\",\"Internal Error, Contact Support\",VLOOKUP(eDESIND!R9,DI!$A$5:$B$400,2,FALSE))","v":{"$error":"#N/A"}},{"$f":"IF($R$7=\"Invalid\",\"Internal Error, Contact Support\",VLOOKUP(eDESIND!T9,DI!$A$5:$B$400,2,FALSE))","v":{"$error":"#N/A"}},{"$f":"IF($R$7=\"Invalid\",\"Internal Error, Contact Support\",VLOOKUP(eDESIND!V9,DI!$A$5:$B$400,2,FALSE))","v":{"$error":"#N/A"}},{"$f":"IF($R$7=\"Invalid\",\"Internal Error, Contact Support\",VLOOKUP(eDESIND!X9,DI!$A$5:$B$400,2,FALSE))","v":{"$error":"#N/A"}},{"$f":"IF($R$7=\"Invalid\",\"Internal Error, Contact Support\",VLOOKUP(eDESIND!Z9,DI!$A$5:$B$400,2,FALSE))","v":{"$error":"#N/A"}},{"$f":"IF($R$7=\"Invalid\",\"Internal Error, Contact Support\",VLOOKUP(eDESIND!AB9,DI!$A$5:$B$400,2,FALSE))","v":{"$error":"#N/A"}}]
[{"$f":"eSPAR!A9","v":0},{"$f":"eSPAR!B9","v":0},{"$f":"IF($R$7=\"Invalid\",\"Internal Error, Contact Support\",VLOOKUP(eDESIND!D10,DI!$A$5:$B$400,2,FALSE))","v":{"$error":"#N/A"}},{"$f":"IF($R$7=\"Invalid\",\"Internal Error, Contact Support\",VLOOKUP(eDESIND!F10,DI!$A$5:$B$400,2,FALSE))","v":{"$error":"#N/A"}},{"$f":"IF($R$7=\"Invalid\",\"Internal Error, Contact Support\",VLOOKUP(eDESIND!H10,DI!$A$5:$B$400,2,FALSE))","v":{"$error":"#N/A"}},{"$f":"IF($R$7=\"Invalid\",\"Internal Error, Contact Support\",VLOOKUP(eDESIND!J10,DI!$A$5:$B$400,2,FALSE))","v":{"$error":"#N/A"}},{"$f":"IF($R$7=\"Invalid\",\"Internal Error, Contact Support\",VLOOKUP(eDESIND!L10,DI!$A$5:$B$400,2,FALSE))","v":{"$error":"#N/A"}},{"$f":"IF($R$7=\"Invalid\",\"Internal Error, Contact Support\",VLOOKUP(eDESIND!N10,DI!$A$5:$B$400,2,FALSE))","v":{"$error":"#N/A"}},{"$f":"IF($R$7=\"Invalid\",\"Internal Error, Contact Support\",VLOOKUP(eDESIND!P10,DI!$A$5:$B$400,2,FALSE))","v":{"$error":"#N/A"}},{"$f":"IF($R$7=\"Invalid\",\"Internal Error, Contact Support\",VLOOKUP(eDESIND!R10,DI!$A$5:$B$400,2,FALSE))","v":{"$error":"#N/A"}},{"$f":"IF($R$7=\"Invalid\",\"Internal Error, Contact Support\",VLOOKUP(eDESIND!T10,DI!$A$5:$B$400,2,FALSE))","v":{"$error":"#N/A"}},{"$f":"IF($R$7=\"Invalid\",\"Internal Error, Contact Support\",VLOOKUP(eDESIND!V10,DI!$A$5:$B$400,2,FALSE))","v":{"$error":"#N/A"}},{"$f":"IF($R$7=\"Invalid\",\"Internal Error, Contact Support\",VLOOKUP(eDESIND!X10,DI!$A$5:$B$400,2,FALSE))","v":{"$error":"#N/A"}},{"$f":"IF($R$7=\"Invalid\",\"Internal Error, Contact Support\",VLOOKUP(eDESIND!Z10,DI!$A$5:$B$400,2,FALSE))","v":{"$error":"#N/A"}},{"$f":"IF($R$7=\"Invalid\",\"Internal Error, Contact Support\",VLOOKUP(eDESIND!AB10,DI!$A$5:$B$400,2,FALSE))","v":{"$error":"#N/A"}}]
{"$rows_left_out":76}